{"text_format":"3","workbook":"xlsx","n_sheets":3,"sheets":["名单","准考证","Sheet1"],"not_rendered":{"defined_names":4},"read":"whole","date_system":"1900"}

{"sheet":"名单","index":0,"n_rows":3,"n_cols":13,"rows_kept":3,"merged":[[0,0,0,12]]}
["清远市清城区城市管理和综合执法局公开招聘报名情况表"]
["序号","准考证号","岗位","姓名","性别","学历学位","毕业学校","专业","联系电话","电子邮箱","身份证号码","照片","备注"]
[{"$f":"SUBTOTAL(3,C$2:C3)-1","v":1},"/","网格监督员","示例","男","本科/学士","广东技术师范学院天河学院","汉语言文学"]

{"sheet":"准考证","index":1,"n_rows":8,"n_cols":9,"rows_kept":8,"merged":[[0,0,0,7],[1,1,1,3],[1,4,3,4],[1,5,1,7],[2,1,2,3],[2,5,7,7],[3,1,3,3],[4,1,4,4],[5,1,5,4],[6,1,6,4],[7,1,7,4]]}
["清远市清城区城市管理和综合执法局公开招聘准考证"]
["姓    名：",{"$f":"VLOOKUP(I2,名单!A:K,4,0)","v":{"$error":"#N/A"}},null,null,{"$f":"INDEX(名单!L3:L22,MATCH(B2,名单!D3:D22,0))","v":{"$error":"#N/A"}},"考试须知",null,null,44]
["性    别：",{"$f":"VLOOKUP(I2,名单!A:K,5,0)","v":{"$error":"#N/A"}},{"$nulls":3},"一、考生凭身份证、准考证提前15分钟进入指定试室，按抽签号码对号入座，并将身份证、准考证放在桌子左上角，以便查对。禁止携带任何书籍、笔记、资料、报刊、草稿纸以及各种无线通讯工具(如寻呼机、移动电话)、电子笔记本等与考试无关的物品。\n\n二、考生在开考10分钟后不得入场，进入考场后自觉服从监考员管理。对扰乱考场秩序、恐吓或威胁监考员人身安全的考生，依法移交公安机关追究法律责任。"]
["准考证号：",{"$f":"VLOOKUP(I2,名单!A:K,2,0)","v":{"$error":"#N/A"}}]
["身份证号：",{"$f":"VLOOKUP(I2,名单!A:K,11,0)","v":{"$error":"#N/A"}}]
["报考岗位：",{"$f":"VLOOKUP(I2,名单!A:K,3,0)","v":{"$error":"#N/A"}}]
["考试时间：","另行通知"]
["考试地点：","另行通知"]

{"sheet":"Sheet1","index":2,"n_rows":32,"n_cols":6,"rows_kept":32}
["准考证号","姓名","准考证号","姓名","准考证号","姓名"]
["bsy001","林雨平","bsy002","曾文文","bsy003","陈鸿华"]
["准考证号","姓名","准考证号","姓名","准考证号","姓名"]
["bsy004","陈俊","bsy005","陈敏","bsy006","成振华"]
["准考证号","姓名","准考证号","姓名","准考证号","姓名"]
["bsy007","黄妍乔","bsy008","黄梓维","bsy009","金鹏"]
["准考证号","姓名","准考证号","姓名","准考证号","姓名"]
["bsy010","李燮莹","bsy011","梁剑锋","bsy012","刘荣灿"]
["准考证号","姓名","准考证号","姓名","准考证号","姓名"]
["bsy013","刘燊","bsy014","刘雅婷","bsy015","张映婷"]
["准考证号","姓名","准考证号","姓名","准考证号","姓名"]
["bsy016","钟绮祈","bsy017","周欢","bsy018","陈清云"]
["准考证号","姓名","准考证号","姓名","准考证号","姓名"]
["bsy019","陈芳芳","bsy020","李蓝","bsy021","刘浩正"]
["准考证号","姓名","准考证号","姓名","准考证号","姓名"]
["bsy022","潘永","bsy023","何文靖","bsy024","黎恩飞"]
["准考证号","姓名","准考证号","姓名","准考证号","姓名"]
["bsy025","欧俊君","bsy026","伍楚华","bsy027","杨文栋"]
["准考证号","姓名","准考证号","姓名","准考证号","姓名"]
["bsy028","符美彬","bsy029","陈秋愉","bsy030","张沛健"]
["准考证号","姓名","准考证号","姓名","准考证号","姓名"]
["bsy031","钟嘉欣","bsy032","陈思敏","bsy033","郑绮雯"]
["准考证号","姓名","准考证号","姓名","准考证号","姓名"]
["bsy034","黄舒琦","bsy035","林欣茹","bsy036","刘燊辉"]
["准考证号","姓名","准考证号","姓名","准考证号","姓名"]
["bsy037","王善莹","bsy038","苏淑贤","bsy039","孙颖璇"]
["准考证号","姓名","准考证号","姓名","准考证号","姓名"]
["bsy040","夏宇恒","bsy041","徐炜杰","bsy042","杨幼婷"]
["准考证号","姓名","准考证号","姓名","准考证号","姓名"]
["bsy043","张淼 ","bsy044","何荣坚","ddy001","魏金"]
["准考证号","姓名","准考证号","姓名","准考证号","姓名"]
["ddy002","唐文诗"]